﻿"Dublin Core:Creator","Dublin Core:Title","Dublin Core:Publisher","Dublin Core:Date","Dublin Core:Description","Dublin Core:Language","Dublin Core:Subject","Dublin Core:Source","Dublin Core:Contributor","Dublin Core:Rights","Dublin Core:Relation","Dublin Core:Format","Dublin Core:Type","Dublin Core:Identifier","Dublin Core:Coverage","Item Type Metadata:Text","Item Type Metadata:Entrevistador","Item Type Metadata:Entrevistado","Item Type Metadata:Location","Item Type Metadata:Transcrição","Item Type Metadata:Local URL","Item Type Metadata:Formato original","Item Type Metadata:Dimensões físicas","Item Type Metadata:Duration","Item Type Metadata:Compression","Item Type Metadata:Producer","Item Type Metadata:Diretor","Item Type Metadata:Bit Rate/Frequency","Item Type Metadata:Time Summary","Item Type Metadata:Email Body","Item Type Metadata:Subject Line","Item Type Metadata:From","Item Type Metadata:To","Item Type Metadata:CC","Item Type Metadata:BCC","Item Type Metadata:Number of Attachments","Item Type Metadata:Normas","Item Type Metadata:Objetivos","Item Type Metadata:Materiais","Item Type Metadata:Lesson Plan Text","Item Type Metadata:URL","Item Type Metadata:Event Type","Item Type Metadata:Participantes","Item Type Metadata:Birth Date","Item Type Metadata:Birthplace","Item Type Metadata:Death Date","Item Type Metadata:Ocupação","Item Type Metadata:Biographical Text","Item Type Metadata:Bibliografia","Item Type Metadata:Produção técnica","Item Type Metadata:Coordenador","Item Type Metadata:Modelo educacional","Item Type Metadata:ISBN","Item Type Metadata:Resumo da tese","Item Type Metadata:Local","Item Type Metadata:Orientador","Item Type Metadata:Editor de som","Item Type Metadata:Audio Depoimento","Item Type Metadata:Audio Entrevista","Item Type Metadata:Link para Dissertação/Tese","Item Type Metadata:Assunto USP","Item Type Metadata:Nota","Item Type Metadata:Sinopse","Item Type Metadata:Itens da coleção",Zotero:Artist,"Zotero:Attorney Agent",Zotero:Author,"Zotero:Book Author",Zotero:Cartographer,"Zotero:Cast Member",Zotero:Commenter,Zotero:Composer,Zotero:Contributor,Zotero:Cosponsor,Zotero:Counsel,Zotero:Director,Zotero:Editor,Zotero:Guest,Zotero:Interviewee,Zotero:Interviewer,Zotero:Inventor,Zotero:Performer,Zotero:Podcaster,Zotero:Presenter,Zotero:Producer,Zotero:Programmer,Zotero:Recipient,"Zotero:Reviewed Author",Zotero:Scriptwriter,"Zotero:Series Editor",Zotero:Sponsor,Zotero:Translator,"Zotero:Words By","Zotero:Item Type",Zotero:Note,Zotero:DOI,Zotero:ISBN,Zotero:ISSN,"Zotero:Abstract Note","Zotero:Access Date","Zotero:Application Number",Zotero:Archive,"Zotero:Archive Location","Zotero:Artwork Medium","Zotero:Artwork Size",Zotero:Assignee,"Zotero:Audio File Type","Zotero:Audio Recording Format","Zotero:Bill Number","Zotero:Blog Title","Zotero:Book Title","Zotero:Call Number","Zotero:Case Name",Zotero:Code,"Zotero:Code Number","Zotero:Code Pages","Zotero:Code Volume",Zotero:Committee,Zotero:Company,"Zotero:Conference Name",Zotero:Country,Zotero:Court,Zotero:Date,"Zotero:Date Decided","Zotero:Date Enacted","Zotero:Dictionary Title",Zotero:Distributor,"Zotero:Docket Number","Zotero:Document Number",Zotero:Edition,"Zotero:Encyclopedia Title","Zotero:Episode Number",Zotero:Extra,"Zotero:Filing Date","Zotero:First Page","Zotero:Forum Title",Zotero:Genre,Zotero:History,Zotero:Institution,"Zotero:Interview Medium",Zotero:Issue,"Zotero:Issue Date","Zotero:Issuing Authority","Zotero:Journal Abbreviation",Zotero:Label,Zotero:Language,"Zotero:Legal Status","Zotero:Legislative Body","Zotero:Letter Type","Zotero:Library Catalog","Zotero:Manuscript Type","Zotero:Map Type",Zotero:Medium,"Zotero:Meeting Name","Zotero:Name of Act",Zotero:Network,"Zotero:Num Pages",Zotero:Number,"Zotero:Number of Volumes",Zotero:Pages,"Zotero:Patent Number",Zotero:Place,"Zotero:Post Type","Zotero:Presentation Type","Zotero:Priority Numbers","Zotero:Proceedings Title","Zotero:Program Title","Zotero:Programming Language","Zotero:Public Law Number","Zotero:Publication Title",Zotero:Publisher,Zotero:References,"Zotero:Report Number","Zotero:Report Type",Zotero:Reporter,"Zotero:Reporter Volume",Zotero:Rights,"Zotero:Running Time",Zotero:Scale,Zotero:Section,Zotero:Series,"Zotero:Series Number","Zotero:Series Text","Zotero:Series Title",Zotero:Session,"Zotero:Short Title",Zotero:Studio,Zotero:Subject,Zotero:System,"Zotero:Thesis Type",Zotero:Title,Zotero:University,Zotero:URL,Zotero:Version,"Zotero:Video Recording Format",Zotero:Volume,"Zotero:Website Title","Zotero:Website Type","Zotero:Attachment Title","Zotero:Attachment URL",tags,file,itemType,collection,public,featured
"Lehnemann, Celso Pires; Corbelino, Conceição Rodrigues da Silva; Carvalho, Cristina Simões de; Oliveira, Denize Cristina; Alcoforado, Fernando Antonio Guedes; Lima, Hascalon Rodrigues; Ikeda, Hugo Komaje; Guibu, Luci Emi; Pardini, Marcelo; Bariani, Maria Cristina; Morais, Maria Goretti de; Portela, Maria Helena de Rezende Brito; Nomoto, Rie; Vidal, Telma Maria Carlos; Araújo, Teresa Maria da Silva; Monteiro, Carlos Augusto","Trabalho de campo multiprofissional: subdistrito de Vila Madalena, Município de São Paulo",,1981,"26 p.",Português,"CONDIÇÕES SOCIAIS",,,,,,,TCM-143,,,,,,,,,,,,,,,,,,,,,,,,,,,,,,,,,,,,,,,,,"São Paulo",,,,,,,,,,,,,,,,,,,,,,,,,,,,,,,,,,,,,,,,,,,,,,,,,,,,,,,,,,,,,,,,,,,,,,,,,,,,,,,,,,,,,,,,,,,,,,,,,,,,,,,,,,,,,,,,,,,,,,,,,,,,,,,,,,,,,,,,,,,,,,,,,,,https://colecoes.abcd.usp.br/fsp/files/original/6f6336cfd56f6c0aad716d22e76aeae4.pdf,Text,"Trabalho de Campo Multiprofissional - TCM",1,0
"Lefévre, Fernando","Recuperando a fala do social","Faculdade de Saúde Pública da USP",1998,"6 p.",Português,SOCIOLOGIA,,,"É permitida a reprodução parcial ou total desta obra, desde que citada a fonte e autoria, proibindo qualquer uso para fins comerciais.",,PDF,,1143082,,,,,,,,,,,,,,,,,,,,,,,,,,,,,,,,,,,,,,,,,"São Paulo",,,,,,,,,,,,,,,,,,,,,,,,,,,,,,,,,,,,,,,,,,,,,,,,,,,,,,,,,,,,,,,,,,,,,,,,,,,,,,,,,,,,,,,,,,,,,,,,,,,,,,,,,,,,,,,,,,,,,,,,,,,,,,,9,,"Série Monográfica - EIXO Promoção de Saúde",,,,,,,,,,,,,,,,,,https://colecoes.abcd.usp.br/fsp/files/original/9876e6762bc3b1cf292cb29aaa0e9b72.pdf,Text,Textos,1,0
"Leal, Rubens Azzi","Intradermo-reação na amebíase: contribuição para o seu estudo",,1953,"79 p.",Português,,,,,,,,"723236 ",,,,,,,,,,,,,,,,,,,,,,,,,,,,,,,,,,,,,,,,,"São Paulo",,,,,,,"Provimento de cátedra",,,,,,,,,,,,,,,,,,,,,,,,,,,,,,,,,,,,,,,,,,,,,,,,,,,,,,,,,,,,,,,,,,,,,,,,,,,,,,,,,,,,,,,,,,,,,,,,,,,,,,,,,,,,,,,,,,,,,,,,,,,,,,,,,,,,,,,,,,,,https://colecoes.abcd.usp.br/fsp/files/original/0b6e7cb81279fdc2d0edc9f9da20716d.pdf,Text,"Teses de cátedra",1,0
"Laurent, Ruy","[Apresentação do] Departamento de Epidemiologia",,[2000],"2 min 02 seg",,,,,,,,,,,,,,,,,,,,,,,,,,,,,,,,,,,,,,,,,,,,,,"Gallo, Paulo Rogério",,,,,,,,,,,"Em comemoração aos seus 75 anos, a Faculdade de Saúde Pública, através do CEP, houve por bem reunir um conjunto de depoimentos de docentes atuais e aposentados. Surgiu então o projeto Memória Fonográfica de Saúde Pública da Faculdade de Saúde Pública da Universidade de São Paulo (FSP/USP). O material fonográfico vem sendo desenvolvido e produzido no Laboratório de Áudio do CEP onde são registrados os depoimentos de docentes e a locução de outras importantes informações a respeito da Faculdade.",,,,,,,,,,,,,,,,,,,,,,,,,,,,,,,,,,,,,,,,,,,,,,,,,,,,,,,,,,,,,,,,,,,,,,,,,,,,,,,,,,,,,,,,,,,,,,,,,,,,,,,,,,,,,,,,,,,,,,,,,,,,,,,,,,,,,,,,,,,,https://colecoes.abcd.usp.br/fsp/files/original/a5d4d61fc7c5a5960e473a1e891901c9.mp3,Sound,"Memória fonográfica da FSP/USP",1,0
"Lacerda, Adriana Aparecida; Fernandes, Antonio Donizeti; Hirakawa, Carlos; Lima, Cristiane Lenita de; Balzan, Gentil; Veizaga, Hugo Albarracin; Campos, Maria do Rosario; Nogueira, Simone; Derntl, Alice Moreira","Relatório do trabalho de campo multiprofissional do Município de Agudos - SP",,1994,"173 p.",Português,"CONDIÇÕES SOCIAIS",,,,,,,TCM-217,,,,,,,,,,,,,,,,,,,,,,,,,,,,,,,,,,,,,,,,,"São Paulo",,,,,,,,,,,,,,,,,,,,,,,,,,,,,,,,,,,,,,,,,,,,,,,,,,,,,,,,,,,,,,,,,,,,,,,,,,,,,,,,,,,,,,,,,,,,,,,,,,,,,,,,,,,,,,,,,,,,,,,,,,,,,,,,,,,,,,,,,,,,,,,,,,,https://colecoes.abcd.usp.br/fsp/files/original/1e9635d8c02eb41c2b45fe2a17e83488.pdf,Text,"Trabalho de Campo Multiprofissional - TCM",1,0
"Koenigkam, Maria Aparecida; Gattini, Isabel Cursino; Garcia, Francisco C.; Rosa, Maria Célia Oliveira; Souza, Marcilda Vasconcelos de; Silva, Marlúcia da; Santos, Margarida Campos dos; Brenes, José Leonel Coto; Guerra, Hélio Gurgel; Ribeiro, Antonio Carlos; Massoni, ledo Mazzei; Oliveira, Walter Castro de; Vilarinho Jr, Fernando; Tinós, Luiz; Silva, Nelson Nunes da; Mello, Maria da Silva; Castellanos, Roberto A.","Trabalho de campo multiprofissional: Santa Cruz do Rio Pardo",,1974,"175 p.",Português,"NÍVEL DE SAÚDE",,,,,,,TCM-65,,,,,,,,,,,,,,,,,,,,,,,,,,,,,,,,,,,,,,,,,"São Paulo",,,,,,,,,,,,,,,,,,,,,,,,,,,,,,,,,,,,,,,,,,,,,,,,,,,,,,,,,,,,,,,,,,,,,,,,,,,,,,,,,,,,,,,,,,,,,,,,,,,,,,,,,,,,,,,,,,,,,,,,,,,,,,,,,,,,,,,,,,,,,,,,,,,https://colecoes.abcd.usp.br/fsp/files/original/b6da9f15e435a556d72dbbe08dce6a42.pdf,Text,"Trabalho de Campo Multiprofissional - TCM",1,0
"Kisil, Marcos","Educação em administração de saúde na América Latina: a busca de um paradigma","Faculdade de Saúde Pública da USP",1994,,Português,"ADMINISTRAÇÃO EM SAÚDE PÚBLICA/EDUCAÇÃO",,,,,PDF,Livro,579791,,,,,,,,,,,,,,,,,,,,,,,,,,,,,,,,,,,,,,,,,"São Paulo",,,,,,,,,,,,,,,,,,,,,,,,,,,,,,,,,,,,,,,,,,,,,,,,,,,,,,,,,,,,,,,,,,,,,,,,,,,,,,,,,,,,,,,,,,,,,,,,,,,,,,,,,,,,,,,,,,,,,,,,,,,,,,,2,,"AdSaúde Série Temática",,,,,,,,,,,,,,,,,,https://colecoes.abcd.usp.br/fsp/files/original/298eeabd109bc29d760ae2c549535902.pdf,Text,"Editora Eletrônica",1,0
"Kisil, Marcos","Gestão da mudança organizacional","IDS : Faculdade de Saúde Pública da USP : Banco Itaú",1998,"55 p.",Português,"MUDANÇA ORGANIZACIONAL",,,"É permitida a reprodução parcial ou total desta obra, desde que citada a fonte e autoria, proibindo qualquer uso para fins comerciais.",,PDF,Livro,1048958,,,,,,,,,,,,,,,,,,,,,,,,,,,,,,,,,,,,,,,,,"São Paulo",,,,,,,,,,,,,,,,,,,,,,,,,,,,,,,,,,,,,,,,,,,,,,,,,,,,,,,,,,,,,,,,,,,,,,,,,,,,,,,,,,,,,,,,,,,,,,,,,,,,,,,,,,,,,,,,,,,,,,,,,,,,,,,4,,"Série Saúde & Cidadania",,,,,,,,,,,,,,,,,,https://colecoes.abcd.usp.br/fsp/files/original/94e1a8db419c44bd094a5ac787cfd7e2.pdf,Text,"Editora Eletrônica",1,0
"Kanashiro, Ana Rosa E.; Abreu, Carinéa M. Santos; Bernardinelli, Darcy; Nogueira, Diogo Pupo; Silva, Edgar Pereira da; Romano, Elysio Salvador; Tapia, Ernesto Enrique Echevers; Pozzobon, Geraldo; Iwai, Hirofumi; Silveira, Isis Azevedo da; Jorge, José Carlos; Costa, José Viana; Cruz, Luciano Lemos Muniz; Solyon, Luiz; Westphal, Marcia Faria; Maltez, Maria Helena R.; Santos, Maria José dos; Palhares, Mauri; Paliti, Milton; Silveira, Walter Manoel da; Moreira, Wlademir Silveira; Chaves, Zuleika Rasselen; Sampaio, Fernando Carlos de Mesquita; Carvalho, João Pessoa de Paula; Laurenti, Ruy","Estudos das condições de saúde em Vila Madalena",,1970,"117 p.",Português,"CONDIÇÕES SOCIAIS",,,,,,,TCM-18,,,,,,,,,,,,,,,,,,,,,,,,,,,,,,,,,,,,,,,,,"São Paulo",,,,,,,,,,,,,,,,,,,,,,,,,,,,,,,,,,,,,,,,,,,,,,,,,,,,,,,,,,,,,,,,,,,,,,,,,,,,,,,,,,,,,,,,,,,,,,,,,,,,,,,,,,,,,,,,,,,,,,,,,,,,,,,,,,,,,,,,,,,,,,,,,,,https://colecoes.abcd.usp.br/fsp/files/original/75a704951c6e8da996f5922a6cfe4b73.pdf,Text,"Trabalho de Campo Multiprofissional - TCM",1,0
"Kalil, Aldonia Cekaunaskas; Troy, Aparecida Regina; Alvarenga, Augusta Thereza de; Vargas, Cesar Augusto; Guimarães, Fernando de A,; Alvarado, Grover R. P.; Somensi, Jorge; Gusmão, José Marcos de S.; Pera, José Maria; Cardoso, Jupira C.; Tobar, Leonizia Rosa M. R.; Santos, Luiza S. R. dos; Oliveira, Maria Amélia C.; Beozzo, Maria Marcia; Capobianco, Mario; Ribeiro, Neile Gertrudes T.; Modesto, Nevolanda A.; Herz, Rosa Maria O.; Pinto, Vitor Gomes","Relatório do trabalho de campo multiprofissional do Município de Cosmópolis",,1972,"165 p.",Português,"NÍVEL DE SAÚDE",,,,,,,TCM-47,,,,,,,,,,,,,,,,,,,,,,,,,,,,,,,,,,,,,,,,,"São Paulo",,,,,,,,,,,,,,,,,,,,,,,,,,,,,,,,,,,,,,,,,,,,,,,,,,,,,,,,,,,,,,,,,,,,,,,,,,,,,,,,,,,,,,,,,,,,,,,,,,,,,,,,,,,,,,,,,,,,,,,,,,,,,,,,,,,,,,,,,,,,,,,,,,,https://colecoes.abcd.usp.br/fsp/files/original/9103f95a354a37b91b0a75fa48fcf0d1.pdf,Text,"Trabalho de Campo Multiprofissional - TCM",1,0
